Target
Galanin receptor type 3
Ligand
BDBM34598
Substrate
IC50
2058±n/a nM
Citation
 PubChem, PC Fluorescence-based cell-based primary high throughput dose response assay to identify antagonists of the Galanin Receptor 3 (GalR3). PubChem Bioassay (2013)[AID] 
Target
Name:
Galanin receptor type 3
Synonyms:
GALNR3 GALR3_HUMAN Galanin receptor 3 | Galanin receptor type 3
Type:
Enzyme Catalytic Domain
Mol. Mass.:
39599.97
Organism:
Homo sapiens (Human)
Description:
Galanin R3 GALR3 HUMAN::O60755
Residue:
368
  
Inhibitor
Name:
BDBM34598
Synonyms:
MLS000094981 cid_3236301
Type:
Small organic molecule
Emp. Form.:
C9H6N6O4
Mol. Mass.:
262.1817
SMILES:
CCc1nc2c3no[n+]([O-])c3c3non(O)c3c2n1
: