Target
Adenosine receptor A3
Ligand
BDBM99202
Substrate
Meas. Tech.
Binding Assay
Ki
1290±0.0 nM
Citation
 Jagtap, P Adenosine compounds and their use thereof US Patent  US8501708 Publication Date 8/6/2013 
Target
Name:
Adenosine receptor A3
Synonyms:
AA3R_RABIT ADORA3
Type:
Protein
Mol. Mass.:
36319.35
Organism:
Oryctolagus cuniculus (rabbit)
Description:
O02667
Residue:
319
  
Inhibitor
Name:
BDBM99202
Synonyms:
US8501708, 22
Type:
Small organic molecule
Emp. Form.:
C23H29N5O6
Mol. Mass.:
471.5063
SMILES:
COc1cccc(CO[C@H]2CCCC2Nc2ncnc3n(cnc23)C2O[C@H](CO)[C@@H](O)[C@H]2O)c1
: