Target
Neuromedin-K receptor
Ligand
BDBM242749
Substrate
Meas. Tech.
Aequorin Assay with Human NK-3 Receptor
IC50
44.0±n/a nM
Citation
 Hoveyda, HDutheuil, GFraser, G Substituted [1,2,4]triazolo[4,3-a]pyrazines as selective NK-3 receptor antagonists US Patent  US10030025 Publication Date 7/24/2018 
Target
Name:
Neuromedin-K receptor
Synonyms:
NK-3 receptor NK3R NKR Neurokinin B receptor Neuromedin-3 receptor (NK-3R) Neuromedin-K receptor Neuromedin-K receptor (NK3) TAC3R Tachykinin receptor 3 | Tachykinin receptor 3 (NK3)
Type:
Enzyme
Mol. Mass.:
52221.96
Organism:
Homo sapiens (Human)
Description:
P29371
Residue:
465
  
Inhibitor
Name:
BDBM242749
Synonyms:
US10030025, Compound 13 US11731974, Compound 13 US9987274, Compound 13
Type:
Small organic molecule
Emp. Form.:
C17H17FN6O2
Mol. Mass.:
356.3543
SMILES:
CCc1noc(n1)-c1nnc2[C@@H](C)N(CCn12)C(=O)c1ccc(F)cc1
: