Target
RAC-alpha serine/threonine-protein kinase
Ligand
BDBM103146
Substrate
Meas. Tech.
Biochemical Assay
IC50
1.3e+2±n/a nM
Citation
 Ali, SMAshwell, MAKelleher, EKoerner, SLapierre, JLink, JSLiu, YMoussa, MPalma, RTandon, MVensel, DWestlund, NWu, HYang, R Substituted benzo-pyrido-triazolo-diazepine compounds US Patent  US8541407 Publication Date 9/24/2013 
Target
Name:
RAC-alpha serine/threonine-protein kinase
Synonyms:
AKT phosphorylation (p-AKT) AKT1/PPP1CA C-AKT PKB alpha Protein kinase B Protein kinase B (Akt 1) Protein kinase B alpha Proto-oncogene Akt (Akt1) Proto-oncogene c-Akt (AKT1) RAC-PK-alpha RAC-alpha serine/threonine-protein kinase (AKT1) | RAC-alpha serine/threonine-protein kinase (pAKT)
Type:
Enzyme
Mol. Mass.:
55681.25
Organism:
Homo sapiens (Human)
Description:
P31749
Residue:
480
  
Inhibitor
Name:
BDBM103146
Synonyms:
US8541407, 123
Type:
Small organic molecule
Emp. Form.:
C28H23N7O2
Mol. Mass.:
489.5279
SMILES:
COc1cccc(NC(=O)NCc2ccc(cc2)-c2nnc3-c4ccccc4Nc4ncccc4-n23)c1
: