Target
RAC-alpha serine/threonine-protein kinase
Ligand
BDBM103214
Substrate
Meas. Tech.
Biochemical Assay
IC50
48±n/a nM
Citation
 Ali, SMAshwell, MAKelleher, EKoerner, SLapierre, JLink, JSLiu, YMoussa, MPalma, RTandon, MVensel, DWestlund, NWu, HYang, R Substituted benzo-pyrido-triazolo-diazepine compounds US Patent  US8541407 Publication Date 9/24/2013 
Target
Name:
RAC-alpha serine/threonine-protein kinase
Synonyms:
AKT phosphorylation (p-AKT) AKT1/PPP1CA C-AKT PKB alpha Protein kinase B Protein kinase B (Akt 1) Protein kinase B alpha Proto-oncogene Akt (Akt1) Proto-oncogene c-Akt (AKT1) RAC-PK-alpha RAC-alpha serine/threonine-protein kinase (AKT1) | RAC-alpha serine/threonine-protein kinase (pAKT)
Type:
Enzyme
Mol. Mass.:
55681.25
Organism:
Homo sapiens (Human)
Description:
P31749
Residue:
480
  
Inhibitor
Name:
BDBM103214
Synonyms:
US8541407, 191
Type:
Small organic molecule
Emp. Form.:
C34H30N8O
Mol. Mass.:
566.655
SMILES:
O=c1[nH]c(cn1C1CCN(Cc2ccc(cc2)-c2nnc3-c4ccccc4Nc4ncccc4-n23)CC1)-c1ccccc1
: