Target
RAC-alpha serine/threonine-protein kinase
Ligand
BDBM103225
Substrate
Meas. Tech.
Biochemical Assay
IC50
2.1e+2±n/a nM
Citation
 Ali, SMAshwell, MAKelleher, EKoerner, SLapierre, JLink, JSLiu, YMoussa, MPalma, RTandon, MVensel, DWestlund, NWu, HYang, R Substituted benzo-pyrido-triazolo-diazepine compounds US Patent  US8541407 Publication Date 9/24/2013 
Target
Name:
RAC-alpha serine/threonine-protein kinase
Synonyms:
AKT phosphorylation (p-AKT) AKT1/PPP1CA C-AKT PKB alpha Protein kinase B Protein kinase B (Akt 1) Protein kinase B alpha Proto-oncogene Akt (Akt1) Proto-oncogene c-Akt (AKT1) RAC-PK-alpha RAC-alpha serine/threonine-protein kinase (AKT1) | RAC-alpha serine/threonine-protein kinase (pAKT)
Type:
Enzyme
Mol. Mass.:
55681.25
Organism:
Homo sapiens (Human)
Description:
P31749
Residue:
480
  
Inhibitor
Name:
BDBM103225
Synonyms:
US8541407, 202
Type:
Small organic molecule
Emp. Form.:
C30H24FN7
Mol. Mass.:
501.5569
SMILES:
Fc1ccc2c(CCNCc3ccc(cc3)-c3nnc4-c5ccccc5Nc5ncccc5-n34)c[nH]c2c1
: