Target
Genome polyprotein
Ligand
BDBM103275
Substrate
Meas. Tech.
Inhibition Assay
IC50
4e+1±n/a nM
Citation
 Halim, RHarding, MHufton, RMorton, CJJahangiri, SPool, BRJeynes, TPDraffan, AGFrey, BLilly, MJ Viral polymerase inhibitors US Patent  US8546389 Publication Date 10/1/2013 
Target
Name:
Genome polyprotein
Synonyms:
HCV NS5B Polymerase RNA-directed RNA polymerase (NS5B)
Type:
Protein
Mol. Mass.:
329637.29
Organism:
Hepatitis C virus genotype 3a (isolate NZL1) (HCV)
Description:
Q81258
Residue:
3021
  
Inhibitor
Name:
BDBM103275
Synonyms:
US8546389, 190
Type:
Small organic molecule
Emp. Form.:
C29H31BrN6O5S
Mol. Mass.:
655.563
SMILES:
CNC(=O)c1n(nc2cc(N(CCCNC(=O)c3cccnc3OC)S(C)(=O)=O)c(cc12)C1CC1)-c1ccc(Br)cc1
: