Target
Melanin-concentrating hormone receptor 1
Ligand
BDBM103313
Substrate
Meas. Tech.
Calcium Mobilization Assay
IC50
144±n/a nM
Citation
 Schwink, LStengelin, SGossel, MWirth, K Substituted indanes, method for the production thereof, and use thereof as drugs US Patent  US8552199 Publication Date 10/8/2013 
Target
Name:
Melanin-concentrating hormone receptor 1
Synonyms:
G-protein coupled receptor 24 MCH receptor 1 MCH-R1 MCHR-1 MCHR1_HUMAN Melanin-Concentrating Hormone Receptor 1 (MCH1R) Melanin-concentrating hormone receptor 1 (MCH-1) Melanin-concentrating hormone receptor 1 (MCHR-1) SLC-1 Somatostatin receptor-like protein
Type:
G Protein-Coupled Receptor (GPCR)
Mol. Mass.:
45976.27
Organism:
Homo sapiens (Human)
Description:
Membranes from CHO-K1 cells stably expressing human MCH1R were used in assays.
Residue:
422
  
Inhibitor
Name:
BDBM103313
Synonyms:
US8552199, 1-23
Type:
Small organic molecule
Emp. Form.:
C27H36N2O2
Mol. Mass.:
420.5869
SMILES:
CN([C@@H]1Cc2ccc(CNCC(C)(C)C)cc2C1)C(=O)c1ccc(OCC2CC2)cc1
: