Target
Melanin-concentrating hormone receptor 1
Ligand
BDBM103326
Substrate
Meas. Tech.
Calcium Mobilization Assay
IC50
1040±n/a nM
Citation
 Schwink, LStengelin, SGossel, MWirth, K Substituted indanes, method for the production thereof, and use thereof as drugs US Patent  US8552199 Publication Date 10/8/2013 
Target
Name:
Melanin-concentrating hormone receptor 1
Synonyms:
G-protein coupled receptor 24 MCH receptor 1 MCH-R1 MCHR-1 MCHR1_HUMAN Melanin-Concentrating Hormone Receptor 1 (MCH1R) Melanin-concentrating hormone receptor 1 (MCH-1) Melanin-concentrating hormone receptor 1 (MCHR-1) SLC-1 Somatostatin receptor-like protein
Type:
G Protein-Coupled Receptor (GPCR)
Mol. Mass.:
45976.27
Organism:
Homo sapiens (Human)
Description:
Membranes from CHO-K1 cells stably expressing human MCH1R were used in assays.
Residue:
422
  
Inhibitor
Name:
BDBM103326
Synonyms:
US8552199, 1-58
Type:
Small organic molecule
Emp. Form.:
C25H31N3O2
Mol. Mass.:
405.5325
SMILES:
CC1(CNCc2ccc3C[C@H](Cc3c2)NC(=O)c2ccc(OCC3CC3)cn2)CC1
: