Target
5-hydroxytryptamine receptor 6
Ligand
BDBM104361
Substrate
Meas. Tech.
Binding Assay
Ki
0.33±0.0 nM
Citation
 Guzzo, PRHenderson, AJNacro, KIsherwood, MLGhosh, AXiang, K Epiminocycloalkyl[b] indole derivatives as serotonin sub-type 6 (5-HT6) modulators and uses thereof US Patent  US8575186 Publication Date 11/5/2013 
Target
Name:
5-hydroxytryptamine receptor 6
Synonyms:
5-HT-6 5-hydroxytryptamine receptor 6 (5-HT-6) 5-hydroxytryptamine receptor 6 (5HT6) HTR6 Serotonin 6 (5-HT6) receptor | Serotonin Receptor 6
Type:
G Protein-Coupled Receptor (GPCR)
Mol. Mass.:
46968.43
Organism:
Homo sapiens (Human)
Description:
P50406
Residue:
440
  
Inhibitor
Name:
BDBM104361
Synonyms:
US8575186, 124
Type:
Small organic molecule
Emp. Form.:
C22H20FN3O2S
Mol. Mass.:
409.477
SMILES:
Cn1c2CC3CCC(N3)c2c2cc(ccc12)S(=O)(=O)c1cc(F)c2[nH]ccc2c1
: