Target
Orexin/Hypocretin receptor type 1
Ligand
BDBM104689
Substrate
Meas. Tech.
Radioligand Binding Assay
Ki
1.0±0.0 nM
Citation
 Breslin, MJColeman, PJCox, CDSchreier, JD Pyridyl piperidine orexin receptor antagonists US Patent  US8569311 Publication Date 10/29/2013 
Target
Name:
Orexin/Hypocretin receptor type 1
Synonyms:
Hcrtr1 OX1R_RAT Orexin receptor type 1 (OX1R) Ox1-R | Ox1R
Type:
Protein
Mol. Mass.:
46817.55
Organism:
Rattus norvegicus (Rat)
Description:
P56718
Residue:
416
  
Inhibitor
Name:
BDBM104689
Synonyms:
US8569311, A-9
Type:
Small organic molecule
Emp. Form.:
C22H24FN5O2
Mol. Mass.:
409.4567
SMILES:
C[C@@H]1CC[C@@H](COc2ccc(F)cn2)CN1C(=O)c1cc(C)ccc1-n1nccn1
: