Target
Induced myeloid leukemia cell differentiation protein Mcl-1 [172-327]
Ligand
BDBM50400178
Substrate
Meas. Tech.
ITC experiments
pH
8±0
Temperature
298.15±0 K
Kd
9.5e+2±n/a nM
Citation
 Zhang, ZZhao, YSong, TLiu, YLi, XSu, PXie, S Study of binding thermodynamics in the optimization of BH3 mimetics. Chem Biol Drug Des 82:394-400 (2013)  
Target
Name:
Induced myeloid leukemia cell differentiation protein Mcl-1 [172-327]
Synonyms:
BCL2L3 MCL1 Mcl-1 (aa 172-327) | Mcl-1 (residues 172-327)
Type:
Mol. Mass.:
17768.02
Organism:
Homo sapiens (Human)
Description:
Q07820[172-327]
Residue:
156
  
Inhibitor
Name:
BDBM50400178
Synonyms:
2,3‐dihydroxy‐6‐[(4‐ methylphenyl)sulfanyl]anthracene‐9,10‐dione (Ligand 5) | CHEMBL2180318
Type:
Small organic molecule
Emp. Form.:
C21H14O4S
Mol. Mass.:
362.398
SMILES:
Cc1ccc(Sc2ccc3C(=O)c4cc(O)c(O)cc4C(=O)c3c2)cc1
: