Target
D(2) dopamine receptor
Ligand
BDBM50130293
Substrate
Meas. Tech.
Binding Assay
Ki
1.6±0.0 nM
Citation
 Mates, SFienberg, AWennogle, L Methods and compositions for sleep disorders and other disorders US Patent  US8598119 Publication Date 12/3/2013 
Target
Name:
D(2) dopamine receptor
Synonyms:
D(2) dopamine receptor DOPAMINE D2 Long DRD2 Dopamine D2 receptor Dopamine D2 receptor (D2R) Dopamine2-like | d2
Type:
Cell-surface receptors
Mol. Mass.:
50647.10
Organism:
Homo sapiens (Human)
Description:
P14416
Residue:
443
  
Inhibitor
Name:
BDBM50130293
Synonyms:
7-{4-[4-(2,3-dichlorophenyl)piperazin-1-yl]butoxy}-3,4-dihydroquinolin-2(1H)-one CHEMBL1112 US10752588, Compound Aripiprazole US9018213, aripprazole | US9156822, Aripiprazole
Type:
Small organic molecule
Emp. Form.:
C23H27Cl2N3O2
Mol. Mass.:
448.385
SMILES:
Clc1cccc(N2CCN(CCCCOc3ccc4CCC(=O)Nc4c3)CC2)c1Cl
: