Target
Transmembrane prolyl 4-hydroxylase
Ligand
BDBM109272
Substrate
Meas. Tech.
Inhibition Assay
IC50
1.6e+3±n/a nM
Citation
 Thede, KFlamme, IOehme, FErgüden, JStoll, FWild, HKolkhof, PBeck, HJeske, M Substituted dipyridyl-dihydropyrazolones and use thereof US Patent  US8609698 Publication Date 12/17/2013 
Target
Name:
Transmembrane prolyl 4-hydroxylase
Synonyms:
Hypoxia-inducible factor prolyl 4-hydroxylase Hypoxia-inducible factor prolyl hydroxylase 4 P4HTM PH4 | Transmembrane prolyl 4-hydroxylase
Type:
Enzyme
Mol. Mass.:
56654.25
Organism:
Homo sapiens (Human)
Description:
Q9NXG6
Residue:
502
  
Inhibitor
Name:
BDBM109272
Synonyms:
US8609698, 80
Type:
Small organic molecule
Emp. Form.:
C22H19N5O3
Mol. Mass.:
401.418
SMILES:
Cc1ccccc1NC(=O)OCc1ccc(nc1)-n1[nH]cc(-c2cccnc2)c1=O
: