Target
Enteropeptidase
Ligand
BDBM109652
Substrate
Meas. Tech.
Inhibition Assay
Ki
0.31±0.0 nM
Citation
 Konishi, ATokumasu, MSuzuki, TKoshiba, TOhsumi, KIkehara, OKodama, Y Heteroarylcarboxylic acid ester derivative US Patent  US8609715 Publication Date 12/17/2013 
Target
Name:
Enteropeptidase
Synonyms:
ENTK PRSS7 | TMPRSS15
Type:
Enzyme
Mol. Mass.:
112901.62
Organism:
Homo sapiens (Human)
Description:
P98073
Residue:
1019
  
Inhibitor
Name:
BDBM109652
Synonyms:
US8609715, A-60
Type:
Small organic molecule
Emp. Form.:
C18H18N2O7
Mol. Mass.:
374.3447
SMILES:
NC(=N)c1ccc(OC(=O)c2ccc(CC(CCC(O)=O)C(O)=O)o2)cc1
: