Target
Enteropeptidase
Ligand
BDBM109628
Substrate
Meas. Tech.
Inhibition Assay
Ki
0.42±0.0 nM
Citation
 Konishi, ATokumasu, MSuzuki, TKoshiba, TOhsumi, KIkehara, OKodama, Y Heteroarylcarboxylic acid ester derivative US Patent  US8609715 Publication Date 12/17/2013 
Target
Name:
Enteropeptidase
Synonyms:
ENTK PRSS7 | TMPRSS15
Type:
Enzyme
Mol. Mass.:
112901.62
Organism:
Homo sapiens (Human)
Description:
P98073
Residue:
1019
  
Inhibitor
Name:
BDBM109628
Synonyms:
US8609715, B-19
Type:
Small organic molecule
Emp. Form.:
C16H15FN2O4S
Mol. Mass.:
350.365
SMILES:
CC(Cc1ccc(s1)C(=O)Oc1ccc(cc1F)C(N)=N)C(O)=O
: