Target
Enteropeptidase
Ligand
BDBM109692
Substrate
Meas. Tech.
Inhibition Assay
Ki
0.41±0.0 nM
Citation
 Konishi, ATokumasu, MSuzuki, TKoshiba, TOhsumi, KIkehara, OKodama, Y Heteroarylcarboxylic acid ester derivative US Patent  US8609715 Publication Date 12/17/2013 
Target
Name:
Enteropeptidase
Synonyms:
ENTK PRSS7 | TMPRSS15
Type:
Enzyme
Mol. Mass.:
112901.62
Organism:
Homo sapiens (Human)
Description:
P98073
Residue:
1019
  
Inhibitor
Name:
BDBM109692
Synonyms:
US8609715, B-49
Type:
Small organic molecule
Emp. Form.:
C22H24FN3O7S
Mol. Mass.:
493.505
SMILES:
CC(CCC(=O)N[C@@H](CC(O)=O)C(O)=O)Cc1ccc(s1)C(=O)Oc1ccc(cc1F)C(N)=N
: