Target
Serine/threonine-protein kinase pim-1
Ligand
BDBM110767
Substrate
Meas. Tech.
Pim Kinase Binding Activity
pH
7.2±n/a
Ki
0.007±n/a nM
Comments
extracted
Citation
 Hodges, AJMatteucci, MSharpe, ASun, MWang, XTsui, VH Pyrazol-4-yl-heterocyclyl-carboxamide compounds and methods of use US Patent  US8614206 Publication Date 12/24/2013 
Target
Name:
Serine/threonine-protein kinase pim-1
Synonyms:
PIM-1 Kinase PIM1_HUMAN Serine/threonine-protein kinase (PIM1) Serine/threonine-protein kinase PIM1 | Serine/threonine-protein kinase pim-1 (PIM1)
Type:
Protein
Mol. Mass.:
35681.82
Organism:
Homo sapiens (Human)
Description:
P11309
Residue:
313
  
Inhibitor
Name:
BDBM110767
Synonyms:
US8614206, 316 US8614206, 320 | US8614206, 321
Type:
Small organic molecule
Emp. Form.:
C21H25F2N7O2S
Mol. Mass.:
477.531
SMILES:
COC1CC(N)CCN(C1)c1c(NC(=O)c2nc(sc2N)-c2c(F)cccc2F)cnn1C
: