Target
Receptor tyrosine-protein kinase erbB-2
Ligand
BDBM112499
Substrate
Meas. Tech.
ELISA-Based Kinase Assay
pH
7.4±n/a
Temperature
298.15±n/a K
IC50
16.7±0 nM
Comments
extracted
Citation
 Fakhoury, SALee, HTReed, JESchlosser, KMSexton, KETecle, HWinters, RT 4-phenylamino-quinazolin-6-yl-amides US Patent  US8623883 Publication Date 1/7/2014 
Target
Name:
Receptor tyrosine-protein kinase erbB-2
Synonyms:
2.7.10.1 CD_antigen=CD340 ERBB2_HUMAN FASN/HER2 HER2 MLN19 NEU Proto-oncogene Neu Tyrosine kinase-type cell surface receptor HER2 | p185erbB2
Type:
Mol. Mass.:
137894.47
Organism:
Homo sapiens (Human)
Description:
P04626
Residue:
1255
  
Inhibitor
Name:
BDBM112499
Synonyms:
DACOMITINIB WO2022090481, Example dacomitinib
Type:
Small organic molecule
Emp. Form.:
C24H25ClFN5O2
Mol. Mass.:
469.939
SMILES:
COc1cc2ncnc(Nc3ccc(F)c(Cl)c3)c2cc1NC(=O)\C=C\CN1CCCCC1
: