Target
Tyrosine-protein kinase JAK3
Ligand
BDBM112565
Substrate
Meas. Tech.
Inhibition Assay
pH
7.2±n/a
Ki
0.00587±n/a nM
IC50
0.011745±n/a nM
Citation
 de Vicente Fidalgo, JHermann, JCLemoine, RLi, HLovey, AJSjogren, EBSoth, M Inhibitors of JAK US Patent  US8618103 Publication Date 12/31/2013 
Target
Name:
Tyrosine-protein kinase JAK3
Synonyms:
JAK-3 JAK3_HUMAN Janus kinase 3 (JAK3) L-JAK | Leukocyte janus kinase
Type:
Protein
Mol. Mass.:
125111.08
Organism:
Homo sapiens (Human)
Description:
P52333
Residue:
1124
  
Inhibitor
Name:
BDBM112565
Synonyms:
US8618103, I-61
Type:
Small organic molecule
Emp. Form.:
C18H22N6O2S
Mol. Mass.:
386.471
SMILES:
Cc1c[nH]c2ncc(nc12)-c1cccnc1N[C@H]1CCCN(C1)S(C)(=O)=O
: