Target
Orexin receptor type 2
Ligand
BDBM118528
Substrate
Meas. Tech.
Biological Assay
Ki
3564±n/a nM
Citation
 Chai, WLetavic, MALy, KSPippel, DJRudolph, DASappey, KCSavall, BMShah, CRShireman, BTSoyode-Johnson, AStocking, EMSwanson, DM Disubstituted octahydropyrrolo[3,4-c]pyrroles as orexin receptor modulators US Patent  US8653263 Publication Date 2/18/2014 
Target
Name:
Orexin receptor type 2
Synonyms:
HCRTR2 OX2R_HUMAN Orexin receptor type 2 (OR-2) Orexin receptor type 2 (OX2R) Ox-2-R | Ox2-R
Type:
Protein
Mol. Mass.:
50710.53
Organism:
Homo sapiens (Human)
Description:
O43614
Residue:
444
  
Inhibitor
Name:
BDBM118528
Synonyms:
US11059828, Example 181 US8653263, 181 USRE48841, Example 181
Type:
Small organic molecule
Emp. Form.:
C26H23N5O
Mol. Mass.:
421.4937
SMILES:
O=C(N1CC2CN(CC2C1)c1cnc2ccccc2n1)c1ccccc1-c1cccnc1
: