Target
Orexin receptor type 2
Ligand
BDBM118599
Substrate
Meas. Tech.
Biological Assay
Ki
10000±n/a nM
Citation
 Chai, WLetavic, MALy, KSPippel, DJRudolph, DASappey, KCSavall, BMShah, CRShireman, BTSoyode-Johnson, AStocking, EMSwanson, DM Disubstituted octahydropyrrolo[3,4-c]pyrroles as orexin receptor modulators US Patent  US8653263 Publication Date 2/18/2014 
Target
Name:
Orexin receptor type 2
Synonyms:
HCRTR2 OX2R_HUMAN Orexin receptor type 2 (OR-2) Orexin receptor type 2 (OX2R) Ox-2-R | Ox2-R
Type:
Protein
Mol. Mass.:
50710.53
Organism:
Homo sapiens (Human)
Description:
O43614
Residue:
444
  
Inhibitor
Name:
BDBM118599
Synonyms:
US8653263, 252
Type:
Small organic molecule
Emp. Form.:
C19H19FN8O2
Mol. Mass.:
410.405
SMILES:
Cc1nc([nH]c(=O)n1)N1CC2CN(CC2C1)C(=O)c1c(F)cccc1-n1nccn1
: