Target
Prostaglandin E2 receptor EP4 subtype
Ligand
BDBM119446
Substrate
Meas. Tech.
Radioligand Binding Assay:
pH
7.4±n/a
Ki
16±n/a nM
Citation
 Spyvee, MSatoh, TCarlson, JE Pharmaceutical composition US Patent  US8686018 Publication Date 4/1/2014 
Target
Name:
Prostaglandin E2 receptor EP4 subtype
Synonyms:
PE2R4_HUMAN PGE2 receptor EP4 subtype PTGER4 Prostanoid EP4 receptor
Type:
Enzyme
Mol. Mass.:
53134.53
Organism:
Homo sapiens (Human)
Description:
P35408
Residue:
488
  
Inhibitor
Name:
BDBM119446
Synonyms:
US8686018, 105
Type:
Small organic molecule
Emp. Form.:
C23H17F6N3O4
Mol. Mass.:
513.3892
SMILES:
Cn1nc(c(C(=O)NC2(CC2)c2ccc(cc2)C(O)=O)c1Oc1cccc(c1)C(F)(F)F)C(F)(F)F
: