Target
Orexin receptor type 2
Ligand
BDBM119616
Substrate
Meas. Tech.
Radioligand Binding
Temperature
277.15±n/a K
Ki
62±n/a nM
Comments
extracted
Citation
 Branstetter, BJLetavic, MALy, KSRudolph, DASavall, BMShah, CRShireman, BT Fused heterocyclic compounds as orexin receptor modulators US Patent  US8680275 Publication Date 3/25/2014 
Target
Name:
Orexin receptor type 2
Synonyms:
HCRTR2 OX2R_HUMAN Orexin receptor type 2 (OR-2) Orexin receptor type 2 (OX2R) Ox-2-R | Ox2-R
Type:
Protein
Mol. Mass.:
50710.53
Organism:
Homo sapiens (Human)
Description:
O43614
Residue:
444
  
Inhibitor
Name:
BDBM119616
Synonyms:
US8680275, 173
Type:
Small organic molecule
Emp. Form.:
C24H27N5OS
Mol. Mass.:
433.569
SMILES:
Cc1nc(C(=O)N2CC[C@H]3CN([C@H]3C2)c2nc(C)cc(C)n2)c(s1)-c1ccc(C)cc1
: