Target
Leucine-rich repeat serine/threonine-protein kinase 2
Ligand
BDBM129179
Substrate
Meas. Tech.
LabChip Assay
Ki
0.6±n/a nM
Citation
 Baker-Glenn, CBurdick, DJChambers, MChan, BKChen, HEstrada, AGunzner-Tate, JShore, DSweeney, ZKWang, SZhao, G Aminopyrimidine derivatives as LRRK2 modulators US Patent  US8802674 Publication Date 8/12/2014 
Target
Name:
Leucine-rich repeat serine/threonine-protein kinase 2
Synonyms:
Dardarin LRRK2_HUMAN Leucine-rich repeat serine/threonine-protein kinase 2 PARK8
Type:
Protein
Mol. Mass.:
286113.20
Organism:
Homo sapiens (Human)
Description:
Q5S007
Residue:
2527
  
Inhibitor
Name:
BDBM129179
Synonyms:
US8802674, 282
Type:
Small organic molecule
Emp. Form.:
C20H25F3N6O2
Mol. Mass.:
438.4467
SMILES:
CNc1nc(Nc2ccc(cc2OC)C(=O)NC2CCN(C)CC2)ncc1C(F)(F)F
: