Target
Leucine-rich repeat serine/threonine-protein kinase 2
Ligand
BDBM129180
Substrate
Meas. Tech.
LabChip Assay
Ki
1.1±n/a nM
Citation
 Baker-Glenn, CBurdick, DJChambers, MChan, BKChen, HEstrada, AGunzner-Tate, JShore, DSweeney, ZKWang, SZhao, G Aminopyrimidine derivatives as LRRK2 modulators US Patent  US8802674 Publication Date 8/12/2014 
Target
Name:
Leucine-rich repeat serine/threonine-protein kinase 2
Synonyms:
Dardarin LRRK2_HUMAN Leucine-rich repeat serine/threonine-protein kinase 2 PARK8
Type:
Protein
Mol. Mass.:
286113.20
Organism:
Homo sapiens (Human)
Description:
Q5S007
Residue:
2527
  
Inhibitor
Name:
BDBM129180
Synonyms:
US8802674, 283
Type:
Small organic molecule
Emp. Form.:
C20H22F5N5O2
Mol. Mass.:
459.413
SMILES:
CNc1nc(Nc2ccc(cc2OC)C(=O)NC2CCC(F)(F)CC2)ncc1C(F)(F)F
: