Target
Bromodomain-containing protein 4
Ligand
BDBM284968
Substrate
Meas. Tech.
In Vitro Enzyme Inhibition Assay
pH
7.3±n/a
IC50
<500±n/a nM
Comments
extracted
Citation
 Boloor, A Bromodomain inhibitors US Patent  US10023592 Publication Date 7/17/2018 
Target
Name:
Bromodomain-containing protein 4
Synonyms:
BRD4 Bromodomain-containing protein 4 (BRD4) Protein HUNK1
Type:
Protein
Mol. Mass.:
152264.84
Organism:
Homo sapiens (Human)
Description:
O60885
Residue:
1362
  
Inhibitor
Name:
BDBM284968
Synonyms:
N-[3-(2-methyl-1-oxoisoquinolin-4-yl) phenyl]ethanesulfonamide US10941160, Example 13
Type:
Small organic molecule
Emp. Form.:
C18H18N2O3S
Mol. Mass.:
342.412
SMILES:
CCS(=O)(=O)Nc1cccc(c1)-c1cn(C)c(=O)c2ccccc12
: