Target
Bromodomain-containing protein 4
Ligand
BDBM284982
Substrate
Meas. Tech.
In Vitro Enzyme Inhibition Assay
pH
7.3±n/a
IC50
2750±n/a nM
Comments
extracted
Citation
 Boloor, A Bromodomain inhibitors US Patent  US10023592 Publication Date 7/17/2018 
Target
Name:
Bromodomain-containing protein 4
Synonyms:
BRD4 Bromodomain-containing protein 4 (BRD4) Protein HUNK1
Type:
Protein
Mol. Mass.:
152264.84
Organism:
Homo sapiens (Human)
Description:
O60885
Residue:
1362
  
Inhibitor
Name:
BDBM284982
Synonyms:
N-benzyl-3-(2-methyl-1-oxoisoquinolin-4-yl) benzenesulfonamide | US10023592, Example 27
Type:
Small organic molecule
Emp. Form.:
C23H20N2O3S
Mol. Mass.:
404.482
SMILES:
Cn1cc(-c2cccc(c2)S(=O)(=O)NCc2ccccc2)c2ccccc2c1=O
: