Target
Bromodomain-containing protein 4
Ligand
BDBM285032
Substrate
Meas. Tech.
In Vitro Enzyme Inhibition Assay
pH
7.3±n/a
IC50
<500±n/a nM
Comments
extracted
Citation
 Boloor, A Bromodomain inhibitors US Patent  US10023592 Publication Date 7/17/2018 
Target
Name:
Bromodomain-containing protein 4
Synonyms:
BRD4 Bromodomain-containing protein 4 (BRD4) Protein HUNK1
Type:
Protein
Mol. Mass.:
152264.84
Organism:
Homo sapiens (Human)
Description:
O60885
Residue:
1362
  
Inhibitor
Name:
BDBM285032
Synonyms:
N-[3-(6-ethyl-2-methyl-1-oxoisoquinolin-4-yl) phenyl]methanesulfonamide | US10023592, Example 77
Type:
Small organic molecule
Emp. Form.:
C19H20N2O3S
Mol. Mass.:
356.439
SMILES:
CCc1ccc2c(c1)c(cn(C)c2=O)-c1cccc(NS(C)(=O)=O)c1
: