Target
Prostaglandin E2 receptor EP4 subtype
Ligand
BDBM285464
Substrate
Meas. Tech.
EP4 Antagonistic Activity Measurement
Temperature
298.15±n/a K
IC50
1.30±n/a nM
Comments
extracted
Citation
 Asada, MTani, KHirobe, MHiguchi, SFuchibe, KOikawa, RKotani, TTakano, H Tricyclic spiro compound US Patent  US10077247 Publication Date 9/18/2018 
Target
Name:
Prostaglandin E2 receptor EP4 subtype
Synonyms:
PE2R4_HUMAN PGE2 receptor EP4 subtype PTGER4 Prostanoid EP4 receptor
Type:
Enzyme
Mol. Mass.:
53134.53
Organism:
Homo sapiens (Human)
Description:
P35408
Residue:
488
  
Inhibitor
Name:
BDBM285464
Synonyms:
4-{4-Cyano-2-[({2′R, 4S)-6-[(1-methyl 1H-pyrazol-4-yl)carbamoyl]-2,3-dihydrospiro[chromene-4,1′-cyclopropan]-2′-yl}carbonyl)amino]phenyl}butanoic acid | US10077247, Example 2-5
Type:
Small organic molecule
Emp. Form.:
C28H27N5O5
Mol. Mass.:
513.5445
SMILES:
Cn1cc(NC(=O)c2ccc3OCC[C@]4(C[C@H]4C(=O)Nc4cc(ccc4CCCC(O)=O)C#N)c3c2)cn1
: