Target
5-hydroxytryptamine receptor 5A
Ligand
BDBM135787
Substrate
Meas. Tech.
Binding Inhibition Assay
pH
7.5±n/a
Temperature
298.15±n/a K
Ki
7.1±n/a nM
Comments
extracted
Citation
 Kinoyama, IMiyazaki, TKoganemaru, YWashio, THamaguchi, W Nitrogenous-ring acylguanidine derivative US Patent  US8853242 Publication Date 10/7/2014 
Target
Name:
5-hydroxytryptamine receptor 5A
Synonyms:
5-HT-5 5-hydroxytryptamine receptor 5 (5-HT5) 5HT5A_HUMAN Serotonin (5-HT) receptor | Serotonin receptor 5A
Type:
Enzyme
Mol. Mass.:
40266.25
Organism:
Homo sapiens (Human)
Description:
P47898
Residue:
357
  
Inhibitor
Name:
BDBM135787
Synonyms:
US8853242, 159
Type:
Small organic molecule
Emp. Form.:
C18H14F2N4O2
Mol. Mass.:
356.3262
SMILES:
COc1cccc(F)c1-c1ncc(F)c2ccc(cc12)C(=O)N=C(N)N
: