Target
Orexin/Hypocretin receptor type 1
Ligand
BDBM143781
Substrate
Meas. Tech.
Radioligand Binding Assay
Temperature
277.15±n/a K
Ki
184±n/a nM
Comments
extracted
Citation
 Gelin, CFLebold, TPShireman, BT Substituted 2-azabicycles and their use as orexin receptor modulators US Patent  US8969352 Publication Date 3/3/2015 
Target
Name:
Orexin/Hypocretin receptor type 1
Synonyms:
Hcrtr1 OX1R_RAT Orexin receptor type 1 (OX1R) Ox1-R | Ox1R
Type:
Protein
Mol. Mass.:
46817.55
Organism:
Rattus norvegicus (Rat)
Description:
P56718
Residue:
416
  
Inhibitor
Name:
BDBM143781
Synonyms:
US10183953, Example 42 US9611277, Example 42 | US9845333, 42
Type:
Small organic molecule
Emp. Form.:
C21H18F3N3O2
Mol. Mass.:
401.3817
SMILES:
FC(F)(F)c1ccc(OC2CC3CC2N(C3)C(=O)c2cccc3cc[nH]c23)nc1
: