Target
Mu-type opioid receptor
Ligand
BDBM144357
Substrate
Meas. Tech.
Binding Assay
pH
7.4±n/a
Temperature
323.15±n/a K
Ki
4.89±n/a nM
Comments
extracted
Citation
 Goehring, RTafesse, LYao, J Buprenorphine analogs US Patent  US8969358 Publication Date 3/3/2015 
Target
Name:
Mu-type opioid receptor
Synonyms:
M-OR-1 MOR-1 MUOR1 Mu opiate receptor OPRM1 hMOP | mu-type opioid receptor isoform MOR-1
Type:
G Protein-Coupled Receptor (GPCR)
Mol. Mass.:
44789.51
Organism:
Homo sapiens (Human)
Description:
P35372
Residue:
400
  
Inhibitor
Name:
BDBM144357
Synonyms:
US8969358, 108
Type:
Small organic molecule
Emp. Form.:
C28H37N3O6
Mol. Mass.:
511.6099
SMILES:
CO[C@]12CC[C@@]3(C[C@@H]1CNC(=O)[C@@H](N)CC(O)=O)[C@H]1Cc4ccc(O)c5O[C@@H]2[C@]3(CCN1CC1CC1)c45
: