Target
Kappa-type opioid receptor
Ligand
BDBM144355
Substrate
Meas. Tech.
Binding Assay
pH
7.4±n/a
Temperature
277.15±n/a K
Ki
0.07±n/a nM
Comments
extracted
Citation
 Goehring, RTafesse, LYao, J Buprenorphine analogs US Patent  US8969358 Publication Date 3/3/2015 
Target
Name:
Kappa-type opioid receptor
Synonyms:
K-OR-1 Kappa-opioid receptor (KOR) Kappa-type opioid receptor (KOR) OPIATE Kappa OPRK1 kappa opioid receptor (KOR)
Type:
G Protein-Coupled Receptor (GPCR)
Mol. Mass.:
42648.76
Organism:
Homo sapiens (Human)
Description:
P41145
Residue:
380
  
Inhibitor
Name:
BDBM144355
Synonyms:
US8969358, 106
Type:
Small organic molecule
Emp. Form.:
C29H39N3O4
Mol. Mass.:
493.6377
SMILES:
CO[C@]12CC[C@@]3(C[C@@H]1CNC(=O)C1CCCN1)[C@H]1Cc4ccc(O)c5O[C@@H]2[C@]3(CCN1CC1CC1)c45
: