Target
Delta-type opioid receptor
Ligand
BDBM144383
Substrate
Meas. Tech.
Binding Assay
pH
7.4±n/a
Temperature
298.15±n/a K
Ki
6.46±n/a nM
Comments
extracted
Citation
 Goehring, RTafesse, LYao, J Buprenorphine analogs US Patent  US8969358 Publication Date 3/3/2015 
Target
Name:
Delta-type opioid receptor
Synonyms:
D-OR-1 Delta opioid receptor OPIATE Delta OPRD1 OPRK1 | opioid receptor, delta 1
Type:
G Protein-Coupled Receptor (GPCR)
Mol. Mass.:
40382.98
Organism:
Homo sapiens (Human)
Description:
Competition binding assays were carried out using membrane preparations from transfected HN9.10 cells that constitutively expressed the delta opioid receptor.
Residue:
372
  
Inhibitor
Name:
BDBM144383
Synonyms:
US8969358, 134
Type:
Small organic molecule
Emp. Form.:
C32H36N2O6
Mol. Mass.:
544.638
SMILES:
COC12CC[C@@]3(C[C@@H]1CNC(=O)c1ccccc1C(O)=O)[C@H]1Cc4ccc(O)c5O[C@@H]2[C@]3(CCN1CC1CC1)c45
: