Target
Sphingosine 1-phosphate receptor 2
Ligand
BDBM149710
Substrate
Meas. Tech.
Fluorescence-Based Assay
pH
7.2±n/a
Temperature
310.15±n/a K
IC50
1±n/a nM
Comments
extracted
Citation
 Naganawa, AKusumi, KOtsuki, KSekiguchi, TKakuuchi, AShinozaki, KYamamoto, HNonaka, S Phenyl derivative US Patent  US8975409 Publication Date 3/10/2015 
Target
Name:
Sphingosine 1-phosphate receptor 2
Synonyms:
Edg5 S1pr2 | Sphingosine 1-phosphate receptor 2 (S1P2)
Type:
Protein
Mol. Mass.:
38749.58
Organism:
Rattus norvegicus (Rat)
Description:
P47752
Residue:
352
  
Inhibitor
Name:
BDBM149710
Synonyms:
US8975409, Example 38
Type:
Small organic molecule
Emp. Form.:
C33H37FN2O7
Mol. Mass.:
592.6545
SMILES:
CC(C)CC1(O)CCN(CC1)C(=O)Nc1cc(Oc2ccc(F)cc2)cc(c1)C(=O)Oc1ccc(cc1)C(C)(C)C(O)=O
: