Target
Tyrosine-protein kinase JAK1
Ligand
BDBM286208
Substrate
Meas. Tech.
JAK Caliper Enzyme Assay at 1 mM ATP
pH
7.4±n/a
Temperature
298.15±n/a K
IC50
0.200±n/a nM
Comments
extracted
Citation
 Coe, JWDehnhardt, CMJones, PSabnis, YAStrohbach, JWWakenhut, FMWhitlock, GA Pyrazolopyridines and pyrazolopyrimidines US Patent  US9518052 Publication Date 12/13/2016 
Target
Name:
Tyrosine-protein kinase JAK1
Synonyms:
JAK-1 JAK1A JAK1_HUMAN Janus kinase 1 (JAK1) | Janus kinase 1 JAK1
Type:
Protein
Mol. Mass.:
133293.73
Organism:
Homo sapiens (Human)
Description:
P23458
Residue:
1154
  
Inhibitor
Name:
BDBM286208
Synonyms:
US9518052, Example 125
Type:
Small organic molecule
Emp. Form.:
C23H27N5OS
Mol. Mass.:
421.558
SMILES:
CCc1cc(O)ccc1-c1cc(N)c(C=N)c(NCc2ccccc2N(C)SC)n1
: