Target
Tyrosine-protein kinase JAK1
Ligand
BDBM286364
Substrate
Meas. Tech.
JAK Caliper Enzyme Assay at 1 mM ATP
pH
7.4±n/a
Temperature
298.15±n/a K
IC50
<0.500±n/a nM
Comments
extracted
Citation
 Coe, JWDehnhardt, CMJones, PSabnis, YAStrohbach, JWWakenhut, FMWhitlock, GA Pyrazolopyridines and pyrazolopyrimidines US Patent  US9518052 Publication Date 12/13/2016 
Target
Name:
Tyrosine-protein kinase JAK1
Synonyms:
JAK-1 JAK1A JAK1_HUMAN Janus kinase 1 (JAK1) | Janus kinase 1 JAK1
Type:
Protein
Mol. Mass.:
133293.73
Organism:
Homo sapiens (Human)
Description:
P23458
Residue:
1154
  
Inhibitor
Name:
BDBM286364
Synonyms:
N-[2-({[6-(2-ethyl-5-fluoro-4-hydroxyphenyl)-1H-pyrazolo[4,3-c]pyridin-4-yl]amino}methyl)-3-fluorophenyl]-N-methylmethanesulfon-amide hydrochloride | US9518052, Example 134
Type:
Small organic molecule
Emp. Form.:
C23H25F2N5O3S
Mol. Mass.:
489.538
SMILES:
CCc1cc(O)c(F)cc1-c1cc(N)c(C=N)c(NCc2c(F)cccc2N(C)S(C)(=O)=O)n1
: