Target
Poly-beta-1,6-N-acetyl-D-glucosamine N-deacetylase
Ligand
BDBM150809
Substrate
Meas. Tech.
Fluorogenic ACC Substrate Assay
pH
7.5±n/a
Ki
>1.000e+6±n/a nM
Comments
extracted
Citation
 Ariyakumaran, RPokrovskaya, VLittle, DJHowell, PLNitz, M Direct Staudinger-Phosphonite Reaction Provides Methylphosphonamidates as Inhibitors of CE4 De-N-acetylases. Chembiochem 16:1350-6 (2015)  
Target
Name:
Poly-beta-1,6-N-acetyl-D-glucosamine N-deacetylase
Synonyms:
PGAB_ECOLI pgaB | ycdR
Type:
Protein
Mol. Mass.:
77407.78
Organism:
Escherichia coli (Enterobacteria)
Description:
P75906
Residue:
672
  
Inhibitor
Name:
BDBM150809
Synonyms:
Sodium N-methylphosphate-1,3-di-O-methyl-6-O-benzyl-beta-D-glucosamine (15e)
Type:
Small organic molecule
Emp. Form.:
C16H25NNaO7P
Mol. Mass.:
397.3357
SMILES:
[Na+].CO[C@@H]1OC(COCc2ccccc2)[C@@H](O)C(OC)[C@@H]1NP(C)([O-])=O
: