Target
C-X-C chemokine receptor type 2
Ligand
BDBM150888
Substrate
Meas. Tech.
In Vitro Inhibition Assay
Temperature
310.15±n/a K
IC50
>10000±n/a nM
Comments
extracted
Citation
 Maeda, DYZebala, JA Pyrimidinecarboxamides as CXCR2 modulators US Patent  US8981106 Publication Date 3/17/2015 
Target
Name:
C-X-C chemokine receptor type 2
Synonyms:
C-X-C chemokine receptor type 2 (CXCR-2) CD_antigen=CD182 CXCR-2 CXCR2_HUMAN GRO/MGSA receptor IL-8 receptor type 2 IL8RB | Interleukin-8 receptor B
Type:
Protein
Mol. Mass.:
40767.88
Organism:
Homo sapiens (Human)
Description:
P25025
Residue:
360
  
Inhibitor
Name:
BDBM150888
Synonyms:
US8981106, 77
Type:
Small organic molecule
Emp. Form.:
C18H19FN2O2S
Mol. Mass.:
346.419
SMILES:
Fc1ccc(NC(=O)c2ccc(SCC3CCOCC3)nc2)cc1
: