Target
Replicase polyprotein 1ab [1541-1855]
Ligand
BDBM154573
Substrate
Meas. Tech.
Surface Plasmon Resonance
pH
7.4±n/a
Kd
2.63e+4±n/a nM
Comments
extracted
Citation
 Lee, HLei, HSantarsiero, BDGatuz, JLCao, SRice, AJPatel, KSzypulinski, MZOjeda, IGhosh, AKJohnson, ME Inhibitor recognition specificity of MERS-CoV papain-like protease may differ from that of SARS-CoV. ACS Chem Biol 10:1456-65 (2015)  
Target
Name:
Replicase polyprotein 1ab [1541-1855]
Synonyms:
R1AB_SARS SARS-CoV PLpro rep
Type:
Hydrolase
Mol. Mass.:
35352.30
Organism:
Human SARS coronavirus (SARS-CoV)
Description:
The SARS-CoV PLpro enzyme (residues 1541 -1855) was expressed and purified from E. coli.
Residue:
315
  
Inhibitor
Name:
BDBM154573
Synonyms:
8-(trifluoromethyl)-9H-purin-6-amine (4) jm5b01461, Compound 188
Type:
Small organic molecule
Emp. Form.:
C6H4F3N5
Mol. Mass.:
203.1247
SMILES:
Nc1ncnc2[nH]c(nc12)C(F)(F)F
: