Target
Orexin/Hypocretin receptor type 1
Ligand
BDBM154933
Substrate
Meas. Tech.
In Vitro Assay
Temperature
310.15±n/a K
IC50
5±n/a nM
Comments
extracted
Citation
 Boss, CBrotschi, CGatfield, JGude, MHeidmann, BSifferlen, TWilliams, JT Proline sulfonamide derivatives as orexin receptor antagonists US Patent  US9000029 Publication Date 4/7/2015 
Target
Name:
Orexin/Hypocretin receptor type 1
Synonyms:
HCRTR1 OX1R_HUMAN Orexin receptor type 1 (OR 1) Orexin receptor type 1 (OX1) Orexin receptor type 1 (OxR1) | Ox1r
Type:
Protein
Mol. Mass.:
47554.50
Organism:
Homo sapiens (Human)
Description:
O43613
Residue:
425
  
Inhibitor
Name:
BDBM154933
Synonyms:
US9000029, 12
Type:
Small organic molecule
Emp. Form.:
C19H21ClN2O3S2
Mol. Mass.:
424.965
SMILES:
CSc1cccc(NC(=O)[C@@H]2CCCN2S(=O)(=O)c2ccc(C)c(Cl)c2)c1
: