Target
Orexin/Hypocretin receptor type 1
Ligand
BDBM158195
Substrate
Meas. Tech.
FLIPR Ca2+ Flux Assay
Ki
0.84±n/a nM
Citation
 Kuduk, SDDi Marco, C 2,5-disubstituted thiomorpholine orexin receptor antagonists US Patent  US9029364 Publication Date 5/12/2015 
Target
Name:
Orexin/Hypocretin receptor type 1
Synonyms:
HCRTR1 OX1R_HUMAN Orexin receptor type 1 (OR 1) Orexin receptor type 1 (OX1) Orexin receptor type 1 (OxR1) | Ox1r
Type:
Protein
Mol. Mass.:
47554.50
Organism:
Homo sapiens (Human)
Description:
O43613
Residue:
425
  
Inhibitor
Name:
BDBM158195
Synonyms:
US9029364, 1
Type:
Small organic molecule
Emp. Form.:
C21H22FN5O2S
Mol. Mass.:
427.495
SMILES:
C[C@@H]1CS[C@@H](COc2ccc(F)cn2)CN1C(=O)c1cc(C)ccc1-n1nccn1
: