Target
5-hydroxytryptamine receptor 6
Ligand
BDBM166233
Substrate
Meas. Tech.
Radioligand Binding Assay
pH
7.5±n/a
Temperature
298.15±n/a K
Ki
0.25±n/a nM
Comments
extracted
Citation
 Guzzo, PRHenderson, AJIsherwood, MLee, CYGhosh, AZhao, H Benzofuro[3,2-c] pyridines and related analogs as serotonin sub-type 6 (5-HT6) modulators for the treatment of obesity, metabolic syndrome, cognition and schizophrenia US Patent  US9067949 Publication Date 6/30/2015 
Target
Name:
5-hydroxytryptamine receptor 6
Synonyms:
5-HT-6 5-hydroxytryptamine receptor 6 (5-HT-6) 5-hydroxytryptamine receptor 6 (5HT6) HTR6 Serotonin 6 (5-HT6) receptor | Serotonin Receptor 6
Type:
G Protein-Coupled Receptor (GPCR)
Mol. Mass.:
46968.43
Organism:
Homo sapiens (Human)
Description:
P50406
Residue:
440
  
Inhibitor
Name:
BDBM166233
Synonyms:
US9067949, 90
Type:
Small organic molecule
Emp. Form.:
C18H16ClNO3S
Mol. Mass.:
361.843
SMILES:
Clc1cc(cc2c3CCNCCc3oc12)S(=O)(=O)c1ccccc1
: