Target
Platelet-derived growth factor receptor beta
Ligand
BDBM50331095
Substrate
Meas. Tech.
VEGFR2 Kinase Assay
pH
7.2±n/a
Temperature
298.15±n/a K
IC50
42.39±0.0 nM
Comments
extracted
Citation
 Yin, YSha, SWang, YTWu, XWang, SFQiao, FLv, PCZhu, HL Discovery of new 4-alkoxyquinazoline-based derivatives as potent VEGFR2 inhibitors. Chem Biol Drug Des 86:1323-9 (2015)  
Target
Name:
Platelet-derived growth factor receptor beta
Synonyms:
Beta-type platelet-derived growth factor receptor CD140b antigen PDGF Receptor Substrate PDGFR PDGFR-1 PDGFRB PGFRB_HUMAN Platelet-derived growth factor receptor 1 Platelet-derived growth factor receptor beta (PDGFR-beta) Platelet-derived growth factor receptor beta (PDGFRbeta) | VHL/PDGFRB
Type:
Enzyme
Mol. Mass.:
123922.25
Organism:
Homo sapiens (Human)
Description:
P09619
Residue:
1106
  
Inhibitor
Name:
BDBM50331095
Synonyms:
CHEMBL1289494 US10464902, Tivozanib
Type:
Small organic molecule
Emp. Form.:
C22H19ClN4O5
Mol. Mass.:
454.863
SMILES:
COc1cc2nccc(Oc3ccc(NC(=O)Nc4cc(C)on4)c(Cl)c3)c2cc1OC
: