Target
Oxysterols receptor LXR-beta
Ligand
BDBM168122
Substrate
Meas. Tech.
Radioligand Binding Assay
Temperature
298.15±n/a K
Ki
5±n/a nM
Comments
extracted
Citation
 Leftheris, KZhuang, L Liver X receptor modulators US Patent  US9073931 Publication Date 7/7/2015 
Target
Name:
Oxysterols receptor LXR-beta
Synonyms:
LXRB Liver X, LXR beta NR1H2 Nuclear receptor NER Ubiquitously-expressed nuclear receptor
Type:
Enzyme Catalytic Domain
Mol. Mass.:
50978.79
Organism:
Homo sapiens (Human)
Description:
P55055
Residue:
460
  
Inhibitor
Name:
BDBM168122
Synonyms:
US9073931, E28
Type:
Small organic molecule
Emp. Form.:
C23H26F3N5O5S
Mol. Mass.:
541.543
SMILES:
CCOC(=O)c1cnc(nc1C(F)(F)F)N1CCn2c(nc3cc(CO)c(cc23)S(C)(=O)=O)C1C(C)C
: