Target
Protease
Ligand
BDBM171370
Substrate
Meas. Tech.
Inhibition Assay
Ki
0.3±n/a nM
Citation
 Ghosh, AK Nonpeptide HIV-1 protease inhibitors US Patent  US9085571 Publication Date 7/21/2015 
Target
Name:
Protease
Synonyms:
Type:
Enzyme
Mol. Mass.:
10904.79
Organism:
Human immunodeficiency virus 1 (HIV-1)
Description:
Q9YQ12
Residue:
99
  
Inhibitor
Name:
BDBM171370
Synonyms:
US9085571, Table 1, Compound 18
Type:
Small organic molecule
Emp. Form.:
C36H44N4O8S
Mol. Mass.:
692.822
SMILES:
COCc1coc(CN(C)C(=O)c2cccc(c2)C(=O)N[C@@H](Cc2ccccc2)[C@H](O)CN(CC(C)C)S(=O)(=O)c2ccc(OC)cc2)n1
: