Target
Kappa-type opioid receptor
Ligand
BDBM173473
Substrate
Meas. Tech.
Radioligand Dose-Displacement Binding Assay
pH
7.4±n/a
Temperature
277.15±n/a K
Ki
35.04±11.84 nM
Comments
extracted
Citation
 Kyle, DJ Quarternized buprenorphine analogs US Patent  US9096606 Publication Date 8/4/2015 
Target
Name:
Kappa-type opioid receptor
Synonyms:
K-OR-1 Kappa-opioid receptor (KOR) Kappa-type opioid receptor (KOR) OPIATE Kappa OPRK1 kappa opioid receptor (KOR)
Type:
G Protein-Coupled Receptor (GPCR)
Mol. Mass.:
42648.76
Organism:
Homo sapiens (Human)
Description:
P41145
Residue:
380
  
Inhibitor
Name:
BDBM173473
Synonyms:
US9096606, 10
Type:
Small organic molecule
Emp. Form.:
C31H40NO5
Mol. Mass.:
506.653
SMILES:
COc1ccc2C[C@@H]3[C@]45CC[C@](OC)([C@@H]6Oc1c2[C@]46CC[N]3(C)CC1CC1)[C@@H](COCc1ccoc1)C5
: