Target
Kappa-type opioid receptor
Ligand
BDBM173478
Substrate
Meas. Tech.
Radioligand Dose-Displacement Binding Assay
pH
7.4±n/a
Temperature
277.15±n/a K
Ki
0.2±0.04 nM
Comments
extracted
Citation
 Kyle, DJ Quarternized buprenorphine analogs US Patent  US9096606 Publication Date 8/4/2015 
Target
Name:
Kappa-type opioid receptor
Synonyms:
K-OR-1 Kappa-opioid receptor (KOR) Kappa-type opioid receptor (KOR) OPIATE Kappa OPRK1 kappa opioid receptor (KOR)
Type:
G Protein-Coupled Receptor (GPCR)
Mol. Mass.:
42648.76
Organism:
Homo sapiens (Human)
Description:
P41145
Residue:
380
  
Inhibitor
Name:
BDBM173478
Synonyms:
US9096606, 15
Type:
Small organic molecule
Emp. Form.:
C30H38NO4S
Mol. Mass.:
508.692
SMILES:
CO[C@]12CC[C@@]3(C[C@@H]1COCc1ccsc1)[C@H]1Cc4ccc(O)c5O[C@@H]2[C@]3(CC[N]1(C)CC1CC1)c45
: