Target
Orexin/Hypocretin receptor type 1
Ligand
BDBM175188
Substrate
Meas. Tech.
Radioligand Binding Assay
Ki
19±n/a nM
Citation
 Dvorak, CAShireman, BT Substituted piperidine compounds and their use as orexin receptor modulators US Patent  US9115117 Publication Date 8/25/2015 
Target
Name:
Orexin/Hypocretin receptor type 1
Synonyms:
HCRTR1 OX1R_HUMAN Orexin receptor type 1 (OR 1) Orexin receptor type 1 (OX1) Orexin receptor type 1 (OxR1) | Ox1r
Type:
Protein
Mol. Mass.:
47554.50
Organism:
Homo sapiens (Human)
Description:
O43613
Residue:
425
  
Inhibitor
Name:
BDBM175188
Synonyms:
US9115117, 90 | US9611251, 90
Type:
Small organic molecule
Emp. Form.:
C20H19F4N7O
Mol. Mass.:
449.4048
SMILES:
C[C@H]1[C@@H](CCCN1C(=O)c1cc(F)ccc1-n1nccn1)Nc1cnc(cn1)C(F)(F)F
: